{"text_format":"1","workbook":"xlsx","n_sheets":7,"sheets":["RIVN_DCF","RIVN_Forecast"," _Comps","Option_Value","RIVN_IS","RIVN_BS","RIVN_CFS"],"not_rendered":{"charts":0,"images":1,"macros":1,"external_links":2,"defined_names":49,"comments":2,"pivot_tables":0},"unopened":[],"bounds":{"document_bytes":16777216,"sheet_cells":100000,"rows_first":2000,"rows_last":500,"rows_between":2000,"halvings":0,"cell_chars":16384,"cell_head_chars":4096},"cells_cut":0,"cells_raw":0,"read":"whole","date_system":"1900"}

{"sheet":"RIVN_DCF","index":0,"n_rows":147,"n_cols":27,"rows_kept":147,"cut":false,"hidden":false,"merged":[]}
[]
[null,"Company Name","Rivian Automotive"]
[null,"Ticker","RIVN"]
[null,"Share Price",14.68]
[null,"Valuation Date ","2025-09-30"]
[]
[null,{"$f":"C2&\" (\"&C3&\") DISCOUNTED CASH FLOWS MODEL\"","v":"Rivian Automotive (RIVN) DISCOUNTED CASH FLOWS MODEL"}]
[null,"Fiscal year ends in December USD in millions except per share data."]
[]
["x","FORECASTING CASH FLOWS"]
[]
[null,null,null,null,null,"Historical",null,null,null,null,"Projected"]
[]
[null,null,null,null,null,2021,{"$f":"F14+1","v":2022},2023,2024,2025,2026,2027,2028,2029,2030,{"$f":"O14+1","v":2031},{"$f":"P14+1","v":2032},{"$f":"Q14+1","v":2033},{"$f":"R14+1","v":2034},{"$f":"S14+1","v":2035},2036,2037,2038]
[null,"Revenues: Automotive",null,null,null,{"$f":"INDEX(RIVN_IS!$A$14:$H$55,MATCH(RIVN_DCF!$B15,RIVN_IS!$A$14:$A$55,0),MATCH(RIVN_DCF!F$14,RIVN_IS!$A$14:$H$14,0))","v":0},{"$f":"INDEX(RIVN_IS!$A$14:$H$55,MATCH(RIVN_DCF!$B15,RIVN_IS!$A$14:$A$55,0),MATCH(RIVN_DCF!G$14,RIVN_IS!$A$14:$H$14,0))","v":1554},{"$f":"INDEX(RIVN_IS!$A$14:$H$55,MATCH(RIVN_DCF!$B15,RIVN_IS!$A$14:$A$55,0),MATCH(RIVN_DCF!H$14,RIVN_IS!$A$14:$H$14,0))","v":4132},{"$f":"INDEX(RIVN_IS!$A$14:$H$55,MATCH(RIVN_DCF!$B15,RIVN_IS!$A$14:$A$55,0),MATCH(RIVN_DCF!I$14,RIVN_IS!$A$14:$H$14,0))","v":4486},{"$f":"INDEX(RIVN_IS!$A$14:$H$55,MATCH(RIVN_DCF!$B15,RIVN_IS!$A$14:$A$55,0),MATCH(RIVN_DCF!J$14,RIVN_IS!$A$14:$H$14,0))","v":3830},{"$f":"J15*(1+K37)","v":4569.7230112319494},6601.9616068042451,10293.334558359627,13592.230077145279,17033.411252610069,19904.673124277357,22843.220054393743,25881.368321628117,29323.590308404655,32255.949339245122,34836.425286384736,36578.246550703974,38407.158878239177]
[null,"Revenues: Software Service",null,null,null,{"$f":"INDEX(RIVN_IS!$A$14:$H$55,MATCH(RIVN_DCF!$B16,RIVN_IS!$A$14:$A$55,0),MATCH(RIVN_DCF!F$14,RIVN_IS!$A$14:$H$14,0))","v":"-"},{"$f":"INDEX(RIVN_IS!$A$14:$H$55,MATCH(RIVN_DCF!$B16,RIVN_IS!$A$14:$A$55,0),MATCH(RIVN_DCF!G$14,RIVN_IS!$A$14:$H$14,0))","v":104},{"$f":"INDEX(RIVN_IS!$A$14:$H$55,MATCH(RIVN_DCF!$B16,RIVN_IS!$A$14:$A$55,0),MATCH(RIVN_DCF!H$14,RIVN_IS!$A$14:$H$14,0))","v":302},{"$f":"INDEX(RIVN_IS!$A$14:$H$55,MATCH(RIVN_DCF!$B16,RIVN_IS!$A$14:$A$55,0),MATCH(RIVN_DCF!I$14,RIVN_IS!$A$14:$H$14,0))","v":484},{"$f":"INDEX(RIVN_IS!$A$14:$H$55,MATCH(RIVN_DCF!$B16,RIVN_IS!$A$14:$A$55,0),MATCH(RIVN_DCF!J$14,RIVN_IS!$A$14:$H$14,0))","v":1557},{"$f":"J16*(1+K38)","v":2335.5},3503.25,5254.875,7356.8249999999998,9563.8724999999995,11954.840624999999,14943.550781249998,18679.438476562496,23349.298095703121,29186.622619628903,35023.94714355468,42028.736572265618,50434.483886718743]
[null,"  Total Revenues",null,null,null,{"$f":"INDEX(RIVN_IS!$A$14:$H$55,MATCH(RIVN_DCF!$B17,RIVN_IS!$A$14:$A$55,0),MATCH(RIVN_DCF!F$14,RIVN_IS!$A$14:$H$14,0))","v":55},{"$f":"INDEX(RIVN_IS!$A$14:$H$55,MATCH(RIVN_DCF!$B17,RIVN_IS!$A$14:$A$55,0),MATCH(RIVN_DCF!G$14,RIVN_IS!$A$14:$H$14,0))","v":1658},{"$f":"INDEX(RIVN_IS!$A$14:$H$55,MATCH(RIVN_DCF!$B17,RIVN_IS!$A$14:$A$55,0),MATCH(RIVN_DCF!H$14,RIVN_IS!$A$14:$H$14,0))","v":4434},{"$f":"INDEX(RIVN_IS!$A$14:$H$55,MATCH(RIVN_DCF!$B17,RIVN_IS!$A$14:$A$55,0),MATCH(RIVN_DCF!I$14,RIVN_IS!$A$14:$H$14,0))","v":4970},{"$f":"INDEX(RIVN_IS!$A$14:$H$55,MATCH(RIVN_DCF!$B17,RIVN_IS!$A$14:$A$55,0),MATCH(RIVN_DCF!J$14,RIVN_IS!$A$14:$H$14,0))","v":5387},{"$f":"K16+K15","v":6905.2230112319494},{"$f":"L16+L15","v":10105.211606804245},15548.209558359627,20949.05507714528,26597.28375261007,31859.513749277357,37786.770835643743,44560.806798190613,52672.888404107776,61442.571958874025,69860.372429939423,78606.983122969599,88841.642764957913]
[null,"  Cost of Revenues: Automotive",null,null,null,{"$f":"INDEX(RIVN_IS!$A$14:$H$55,MATCH(RIVN_DCF!$B18,RIVN_IS!$A$14:$A$55,0),MATCH(RIVN_DCF!F$14,RIVN_IS!$A$14:$H$14,0))","v":520},{"$f":"INDEX(RIVN_IS!$A$14:$H$55,MATCH(RIVN_DCF!$B18,RIVN_IS!$A$14:$A$55,0),MATCH(RIVN_DCF!G$14,RIVN_IS!$A$14:$H$14,0))","v":4666},{"$f":"INDEX(RIVN_IS!$A$14:$H$55,MATCH(RIVN_DCF!$B18,RIVN_IS!$A$14:$A$55,0),MATCH(RIVN_DCF!H$14,RIVN_IS!$A$14:$H$14,0))","v":6150},{"$f":"INDEX(RIVN_IS!$A$14:$H$55,MATCH(RIVN_DCF!$B18,RIVN_IS!$A$14:$A$55,0),MATCH(RIVN_DCF!I$14,RIVN_IS!$A$14:$H$14,0))","v":5693},{"$f":"INDEX(RIVN_IS!$A$14:$H$55,MATCH(RIVN_DCF!$B18,RIVN_IS!$A$14:$A$55,0),MATCH(RIVN_DCF!J$14,RIVN_IS!$A$14:$H$14,0))","v":4262},{"$f":"K15*K40","v":4341.2368606703521},5941.7654461238208,8749.3343746056835,11553.395565573486,13626.729002088055,15923.738499421886,18274.576043514997,20705.094657302496,23458.872246723724,25804.759471396101,27869.14022910779,29262.59724056318,30725.727102591343]
[null,"  Cost of Revenues: Software Service",null,null,null,{"$f":"INDEX(RIVN_IS!$A$14:$H$55,MATCH(RIVN_DCF!$B19,RIVN_IS!$A$14:$A$55,0),MATCH(RIVN_DCF!F$14,RIVN_IS!$A$14:$H$14,0))","v":0},{"$f":"INDEX(RIVN_IS!$A$14:$H$55,MATCH(RIVN_DCF!$B19,RIVN_IS!$A$14:$A$55,0),MATCH(RIVN_DCF!G$14,RIVN_IS!$A$14:$H$14,0))","v":115},{"$f":"INDEX(RIVN_IS!$A$14:$H$55,MATCH(RIVN_DCF!$B19,RIVN_IS!$A$14:$A$55,0),MATCH(RIVN_DCF!H$14,RIVN_IS!$A$14:$H$14,0))","v":314},{"$f":"INDEX(RIVN_IS!$A$14:$H$55,MATCH(RIVN_DCF!$B19,RIVN_IS!$A$14:$A$55,0),MATCH(RIVN_DCF!I$14,RIVN_IS!$A$14:$H$14,0))","v":477},{"$f":"INDEX(RIVN_IS!$A$14:$H$55,MATCH(RIVN_DCF!$B19,RIVN_IS!$A$14:$A$55,0),MATCH(RIVN_DCF!J$14,RIVN_IS!$A$14:$H$14,0))","v":981},{"$f":"K16*K41","v":1401.3},2101.9499999999998,3152.9249999999997,4414.0949999999993,5738.3234999999995,7172.9043749999992,8966.1304687499978,11207.663085937498,14009.578857421873,17511.97357177734,21014.368286132809,25217.241943359371,30260.690332031245]
[null,"Gross Profit",null,null,null,{"$f":"F17-F18-F19","v":-465},-3123,-2030,-1200,144,1162.6861505615973,2061.4961606804245,3645.9501837539442,4981.5645115717944,7232.2312505220152,8762.8708748554709,10546.064323378749,12648.049054950619,15204.437299962179,18125.838915700584,20976.863914698824,24127.143939047051,27855.225330335325]
[]
[null,"  Selling, General and Administrative",null,null,null,{"$f":"INDEX(RIVN_IS!$A$14:$H$55,MATCH(RIVN_DCF!$B22,RIVN_IS!$A$14:$A$55,0),MATCH(RIVN_DCF!F$14,RIVN_IS!$A$14:$H$14,0))","v":1242},{"$f":"INDEX(RIVN_IS!$A$14:$H$55,MATCH(RIVN_DCF!$B22,RIVN_IS!$A$14:$A$55,0),MATCH(RIVN_DCF!G$14,RIVN_IS!$A$14:$H$14,0))","v":1789},{"$f":"INDEX(RIVN_IS!$A$14:$H$55,MATCH(RIVN_DCF!$B22,RIVN_IS!$A$14:$A$55,0),MATCH(RIVN_DCF!H$14,RIVN_IS!$A$14:$H$14,0))","v":1714},{"$f":"INDEX(RIVN_IS!$A$14:$H$55,MATCH(RIVN_DCF!$B22,RIVN_IS!$A$14:$A$55,0),MATCH(RIVN_DCF!I$14,RIVN_IS!$A$14:$H$14,0))","v":1876},{"$f":"INDEX(RIVN_IS!$A$14:$H$55,MATCH(RIVN_DCF!$B22,RIVN_IS!$A$14:$A$55,0),MATCH(RIVN_DCF!J$14,RIVN_IS!$A$14:$H$14,0))","v":2061},{"$f":"K17*K42","v":2416.8280539311822},3031.5634820412733,3887.0523895899069,4189.8110154290562,3989.5925628915102,4380.6831405256362,4723.346354455467,5013.0907647964432,5267.2888404107771,5376.2250464014769,5239.5279322454562,4912.9364451856,4442.0821382478962]
[null,"  Research and Development",null,null,null,{"$f":"INDEX(RIVN_IS!$A$14:$H$55,MATCH(RIVN_DCF!$B23,RIVN_IS!$A$14:$A$55,0),MATCH(RIVN_DCF!F$14,RIVN_IS!$A$14:$H$14,0))","v":1850},{"$f":"INDEX(RIVN_IS!$A$14:$H$55,MATCH(RIVN_DCF!$B23,RIVN_IS!$A$14:$A$55,0),MATCH(RIVN_DCF!G$14,RIVN_IS!$A$14:$H$14,0))","v":1944},{"$f":"INDEX(RIVN_IS!$A$14:$H$55,MATCH(RIVN_DCF!$B23,RIVN_IS!$A$14:$A$55,0),MATCH(RIVN_DCF!H$14,RIVN_IS!$A$14:$H$14,0))","v":1995},{"$f":"INDEX(RIVN_IS!$A$14:$H$55,MATCH(RIVN_DCF!$B23,RIVN_IS!$A$14:$A$55,0),MATCH(RIVN_DCF!I$14,RIVN_IS!$A$14:$H$14,0))","v":1613},{"$f":"INDEX(RIVN_IS!$A$14:$H$55,MATCH(RIVN_DCF!$B23,RIVN_IS!$A$14:$A$55,0),MATCH(RIVN_DCF!J$14,RIVN_IS!$A$14:$H$14,0))","v":1668},{"$f":"K17*K43","v":1726.3057528079873},2021.0423213608492,3109.6419116719258,4189.8110154290562,2659.7283752610074,3026.653806181349,3400.8093752079367,3787.668577846202,4213.8310723286213,4608.1928969155506,4890.2260700957586,5109.453902993022,5330.498565897472]
[null,"EBIT",null,null,null,{"$f":"F20-F22-F23","v":-3557},{"$f":"G20-G22-G23","v":-6856},-5739,-4689,-3585,-2980.4476561775723,-2991.109642721698,{"$f":"M20-M22-M23","v":-3350.7441175078884},{"$f":"N20-N22-N23","v":-3398.057519286318},{"$f":"O20-O22-O23","v":582.91031236949766},{"$f":"P20-P22-P23","v":1355.5339281484858},{"$f":"Q20-Q22-Q23","v":2421.908593715345},{"$f":"R20-R22-R23","v":3847.2897123079742},{"$f":"S20-S22-S23","v":5723.3173872227799},{"$f":"T20-T22-T23","v":8141.4209723835575},10847.10991235761,14104.753590868431,18082.644626189955]
[null,"NOL carryforward balance",null,null,null,null,null,12650,{"$f":"14552+739","v":15291},{"$f":"19044+733","v":19777},{"$f":"IF(K24<0,J25-K24*0.9,J25-MIN(0.8*K24,J25))","v":22459.402890559817},{"$f":"IF(L24<0,K25-L24*0.9,K25-MIN(0.8*L24,K25))","v":25151.401569009344},28167.071274766444,31225.323042124131,30758.994792228532,29674.567649709745,27737.04077473747,24659.20900489109,20080.555095112868,13567.418317206022,4889.7303873199344,0,0]
[null,"Taxes",0.25,null,null,null,null,null,null,null,{"$f":"IF(K24<0,0,IF(J25>K24,K24*0.2*$C$26,(K24-J25)*$C$26))","v":0},{"$f":"IF(L24<0,0,IF(K25>L24,L24*0.2*$C$26,(L24-K25)*$C$26))","v":0},0,0,29.145515618474885,67.776696407424296,121.09542968576726,192.36448561539873,286.16586936113902,407.07104861917787,542.35549561788048,2303.7558008871242,{"$f":"IF(W24<0,0,IF(V25>W24,W24*0.2*$C$26,(W24-V25)*$C$26))","v":4520.6611565474886}]
[null,"Tax-effected EBIT",null,null,null,{"$f":"F24-F26","v":-3557},{"$f":"G24-G26","v":-6856},-5739,-4689,{"$f":"J24-J26","v":-3585},{"$f":"K24-K26","v":-2980.4476561775723},{"$f":"L24-L26","v":-2991.109642721698},{"$f":"M24-M26","v":-3350.7441175078884},-3398.057519286318,553.7647967510228,1287.7572317410616,2300.8131640295778,3654.9252266925755,5437.151517861641,7734.3499237643791,10304.754416739728,11800.997789981308,13561.983469642466]
[]
[null,"Depreciation and amortization",null,null,null,{"$f":"INDEX(RIVN_IS!$A$14:$H$55,MATCH(RIVN_DCF!$B29,RIVN_IS!$A$14:$A$55,0),MATCH(RIVN_DCF!F$14,RIVN_IS!$A$14:$H$14,0))","v":197},{"$f":"INDEX(RIVN_IS!$A$14:$H$55,MATCH(RIVN_DCF!$B29,RIVN_IS!$A$14:$A$55,0),MATCH(RIVN_DCF!G$14,RIVN_IS!$A$14:$H$14,0))","v":652},{"$f":"INDEX(RIVN_IS!$A$14:$H$55,MATCH(RIVN_DCF!$B29,RIVN_IS!$A$14:$A$55,0),MATCH(RIVN_DCF!H$14,RIVN_IS!$A$14:$H$14,0))","v":937},{"$f":"INDEX(RIVN_IS!$A$14:$H$55,MATCH(RIVN_DCF!$B29,RIVN_IS!$A$14:$A$55,0),MATCH(RIVN_DCF!I$14,RIVN_IS!$A$14:$H$14,0))","v":1031},{"$f":"INDEX(RIVN_IS!$A$14:$H$55,MATCH(RIVN_DCF!$B29,RIVN_IS!$A$14:$A$55,0),MATCH(RIVN_DCF!J$14,RIVN_IS!$A$14:$H$14,0))","v":784},{"$f":"-K30*K45","v":1242.9401420217509},{"$f":"-L30*L45","v":2021.0423213608492},{"$f":"-M30*M45","v":2332.2314337539442},2304.396058485981,3324.6604690762592,3621.5306644686366,3884.9523765396211,4118.3933158015216,4345.5132933388886,4488.1878735583723,4475.4301087929898,4366.3722656586979,4219.9780313354977]
[null,"Capex",null,null,null,{"$f":"INDEX(RIVN_IS!$A$14:$H$55,MATCH(RIVN_DCF!$B30,RIVN_IS!$A$14:$A$55,0),MATCH(RIVN_DCF!F$14,RIVN_IS!$A$14:$H$14,0))","v":-1794},{"$f":"INDEX(RIVN_IS!$A$14:$H$55,MATCH(RIVN_DCF!$B30,RIVN_IS!$A$14:$A$55,0),MATCH(RIVN_DCF!G$14,RIVN_IS!$A$14:$H$14,0))","v":-1369},{"$f":"INDEX(RIVN_IS!$A$14:$H$55,MATCH(RIVN_DCF!$B30,RIVN_IS!$A$14:$A$55,0),MATCH(RIVN_DCF!H$14,RIVN_IS!$A$14:$H$14,0))","v":-1026},{"$f":"INDEX(RIVN_IS!$A$14:$H$55,MATCH(RIVN_DCF!$B30,RIVN_IS!$A$14:$A$55,0),MATCH(RIVN_DCF!I$14,RIVN_IS!$A$14:$H$14,0))","v":-1141},{"$f":"INDEX(RIVN_IS!$A$14:$H$55,MATCH(RIVN_DCF!$B30,RIVN_IS!$A$14:$A$55,0),MATCH(RIVN_DCF!J$14,RIVN_IS!$A$14:$H$14,0))","v":-1710},{"$f":"-K44*K17","v":-2071.5669033695849},-2526.3029017010613,-2332.2314337539442,-2094.9055077145281,-2659.7283752610074,-2986.829413994752,-3306.3424481188272,-3620.5655523529867,-3950.4666303080821,-4224.1768221725879,-4366.2732768712121,-4421.6428006670385,-4442.0821382478944]
{"$rows_left_out":118}
{"sheet":"RIVN_Forecast","index":1,"n_rows":114,"n_cols":17,"rows_kept":114,"cut":false,"hidden":false,"merged":[]}
[]
[null,"Key Metrics (Annual)"]
[null,"Dollars in millions",null,"Actual",null,null,null,"Projected"]
[null,null,null,2021,2022,2023,2024,2025,2026,2027,2028,2029,2030,2031,2032,2033,2034]
[null,"Production",null,1015,24337,57232,49476,42284]
[null,"Delivery",null,920,20332,50122,51579,42247,{"$f":"I7+I9+I11","v":69800},{"$f":"J7+J9+J11","v":103170},{"$f":"K7+K9+K11+K13","v":166915.5},{"$f":"L7+L9+L11+L13","v":219086.32499999998},269939.44874999998,306063.23549999995,340185.39301874989,372461.80798781244,407878.7582371406]
[null," R1",null,null,null,{"$f":"F6-F9","v":43332},{"$f":"G6-G9","v":40361},{"$f":"H6-H9","v":30247},26000,{"$f":"I7*(1+J8)","v":27300},28665,30098.25,31603.162500000002,33183.320625,34842.486656250003,36584.610989062501,38413.841538515626]
[null,"  R1 Growth",null,null,null,null,{"$f":"G7/F7-1","v":-6.8563648112249576E-2},{"$f":"H7/G7-1","v":-0.25058843933500163},{"$f":"I7/H7-1","v":-0.14041061923496545},0.05,0.05,0.05,0.05,0.05,0.05,0.05,0.05]
[null," RCV or EDV",null,null,null,{"$f":"SUM(G58:J58)","v":6790},{"$f":"SUM(K58:N58)","v":11218},12000,{"$f":"H9*(1+I10)","v":13799.999999999998},15869.999999999996,18250.499999999993,20988.07499999999,24136.286249999986,26549.914874999988,29204.906362499987,32125.396998749988,35337.936698624988]
[null,"  RCV Growth",null,null,null,null,{"$f":"G9/F9-1","v":0.65213549337260668},{"$f":"H9/G9-1","v":6.9709395614191427E-2},0.15,0.15,0.15,0.15,0.15,0.1,0.1,0.1,0.1]
[null," R2",null,null,null,null,null,null,30000,60000,90000,{"$f":"K11*(1+L12)","v":108000},124199.99999999999,142829.99999999997,157112.99999999997,172824.3,190106.73]
[null,"  R2 Growth",null,null,null,null,null,null,null,null,null,0.2,0.15,0.15,0.1,0.1,0.1]
[null," R3",null,null,null,null,null,null,null,null,30000,60000,90000,{"$f":"M13*(1+N14)","v":103499.99999999999},{"$f":"N13*(1+O14)","v":119024.99999999997},{"$f":"O13*(1+P14)","v":130927.49999999999},{"$f":"P13*(1+Q14)","v":144020.25}]
[null,null,null,null,null,null,null,null,null,null,null,null,0.2,0.15,0.15,0.1,0.1]
[null,"Price Increases",0.03]
[]
[]
[]
[]
[null,"Rev per R1",null,null,null,null,{"$f":"C91/1000000","v":0.09},{"$f":"G20","v":0.09},{"$f":"H20*(1+$C$15)","v":9.2700000000000005E-2},9.548100000000001E-2,9.8345430000000011E-2,0.10129579290000001,0.10433466668700002,0.10746470668761002,0.11068864788823832,0.11400930732488547,0.11742958654463204]
[null,"Rev per RCV",null,null,null,null,{"$f":"C92/1000000","v":4.6399536459261918E-2},{"$f":"G21","v":4.6399536459261918E-2},{"$f":"H21*(1+$C$15)","v":4.7791522553039777E-2},4.922526822963097E-2,5.0702026276519901E-2,5.2223087064815502E-2,5.378977967675997E-2,5.5403473067062774E-2,5.7065577259074657E-2,5.8777544576846898E-2,6.0540870914152306E-2]
[null,"Rev Per R2",null,null,null,null,null,null,0.05,{"$f":"I22*(1+$C$15)","v":5.1500000000000004E-2},5.3045000000000009E-2,5.4636350000000007E-2,5.627544050000001E-2,5.7963703715000009E-2,5.9702614826450014E-2,6.1493693271243516E-2,6.3338504069380824E-2]
[null,"Rev per R3",null,null,null,null,null,null,null,null,0.05,{"$f":"K23*(1+$C$15)","v":5.1500000000000004E-2},{"$f":"L23*(1+$C$15)","v":5.3045000000000009E-2},5.4636350000000007E-2,5.627544050000001E-2,{"$f":"O23*(1+$C$15)","v":5.7963703715000009E-2},5.9702614826450014E-2]
[]
[null,null,null,null,null,null,null,{"$f":"H26/G26-1","v":-0.14623272403031651},{"$f":"I26/H26-1","v":0.19313916742348547},0.41755556975386288,0.54657490665306785,0.31114115053319868,0.24539672807579782,0.15965233789120759,0.13867053027140042,0.12380534437601698,0.12415147466854348]
[null,"Revenues: Automotive",null,0,1554,4132,4486,3830,{"$f":"I7*I20+I9*I21+I11*I22","v":4569.7230112319494},{"$f":"J7*J20+J9*J21+J11*J22","v":6477.8363068042436},{"$f":"K7*K20+K9*K21+K11*K22+K13*K23","v":10018.459081509627},13135.613966700304,16359.050655395311,18970.811338209864,21601.503806158122,24275.885423919372,27289.772398183562]
[null,"Revenues: Software Service",null,"-",104,302,484,1557,{"$f":"H27*(1+I33)","v":2335.5},3503.25,5254.875,7356.8249999999998,9563.8724999999995,11954.840624999999,{"$f":"N27*(1+O33)","v":14943.550781249998},18679.438476562496,23349.298095703121]
[null,"  Total Revenues",null,55,1658,4434,4970,{"$f":"H27+H26","v":5387},6905.2230112319494,9981.0863068042436,15273.334081509627,20492.438966700305,25922.92315539531,30925.651963209864,{"$f":"O27+O26","v":36545.054587408122},42955.323900481868,50639.070493886684]
[]
[null,"% Automotive",null,null,{"$f":"E26/E$28","v":0.93727382388419778},{"$f":"F26/F$28","v":0.93188994136220116},0.90261569416498999,0.71097085576387598,0.66177775921196103,0.64901115045846403,0.65594447342301543,0.64099807680507648,0.63106504452953716,{"$f":"N26/N$28","v":0.61343286669519992},0.59109239403355784,0.56514264634952616,0.53890745094695358]
{"$rows_left_out":85}
{"sheet":" _Comps","index":2,"n_rows":26,"n_cols":17,"rows_kept":26,"cut":false,"hidden":false,"merged":[]}
[]
[null,{"$f":"RIVN_DCF!C2&\"Valuation with Public Comparables\"","v":"Rivian AutomotiveValuation with Public Comparables"}]
[null,{"$f":"RIVN_DCF!B8","v":"Fiscal year ends in December USD in millions except per share data."}]
[null,"Valuation for period ended "]
[null,"Ticker",{"$f":"RIVN_DCF!C3","v":"RIVN"}]
[null,"Valuation Date"]
[null,"Company Name",{"$f":"RIVN_DCF!C2","v":"Rivian Automotive"},null,null,null,null,"Enterprise Value Multiples",null,null,null,null,null,"Equity Value Multiples"]
[null,null,null,null,null,"Market Value","Enterprise",null,null,null,"Forward","5 year growth","BV","Forward","Forward","Price(Market)-","Cash/MS as "]
[null,"Company","Ticker","Share price",null,"of Equity","Value","EV/Sales","EV/EBIT","EV/EBITDA","EPS","rate","Equity","P/E","PEG","to-Book","% of TA"]
[null,{"$f":"RIVN_DCF!C2","v":"Rivian Automotive"},{"$f":"C5","v":"RIVN"},{"$f":"RIVN_DCF!C4","v":14.68}]
[]
[]
[]
[]
[]
[]
[]
[]
[null,null,null,null,null,null,"High"]
[null,null,null,null,null,null,"Mean"]
[null,null,null,null,null,null,"Median"]
[null,null,null,null,null,null,"Low"]
[]
[]
[null,null,null,"Implied price per share","Diluted shares outstanding","Implied Equity Value","Implied Enterprise Value","Range of EV/Sales","Range of EV/EBIT","Range of EV/EBITDA",null,null,null,"Range of Forward P/E","Range of Forward PEG","Range of Price-to-Book","Excess Cash"]
[null,{"$f":"RIVN_DCF!C2","v":"Rivian Automotive"}]

{"sheet":"Option_Value","index":3,"n_rows":30,"n_cols":7,"rows_kept":30,"cut":false,"hidden":false,"merged":[]}
[]
[null,"Valuing Options or Warrants"]
[null,"Enter the current stock price ="]
[null,"Enter the strike price on the option ="]
[null,"Enter the expiration of the option ="]
[null,"Enter the standard deviation in stock prices =",null,null,null,"(volatility)"]
[null,"Enter the annualized dividend yield on stock ="]
[null,"Enter the treasury bond rate ="]
[null,"Enter the number of options outstanding ="]
[null,"Enter the number of shares outstanding ="]
[]
[null,"Circuit Breaker","OFF"]
[]
[null,"Do not input any numbers below this line"]
[null,"VALUING WARRANTS WHEN THERE IS DILUTION"]
[null,"Stock Price=",null,{"$f":"E3","v":0},"# Warrants issued=",null,{"$f":"E9","v":0}]
[null,"Strike Price=",null,{"$f":"E4","v":0},"# Shares outstanding=",null,{"$f":"E10","v":0}]
[null,"Adjusted S =",null,{"$f":"(D16*G17+D29*G16)/(G17+G16)","v":{"$error":"#DIV/0!"}},"T.Bond rate=",null,{"$f":"E8","v":0}]
[null,"Adjusted K =",null,{"$f":"D17","v":0},"Variance=",null,{"$f":"E6^2","v":0}]
[null,"Expiration (in years) =",null,{"$f":"E5","v":0},"Annualized dividend yield=",null,{"$f":"E7","v":0}]
[null,null,null,null,"Div. Adj. interest rate=",null,{"$f":"G18-G20","v":0}]
[]
[null,"d1 = ",{"$f":"(LN(D18/D19)+(G21+(G19/2))*D20)/(((G19)^(0.5))*(D20^0.5))","v":{"$error":"#DIV/0!"}}]
[null,"N (d1) =",{"$f":"NORMSDIST(C23)","v":{"$error":"#DIV/0!"}}]
[]
[null,"d2 = ",{"$f":"C23-((G19^0.5)*(D20^(0.5)))","v":{"$error":"#DIV/0!"}}]
[null,"N (d2) =",{"$f":"NORMSDIST(C26)","v":{"$error":"#DIV/0!"}}]
[]
[null,"Value per option = ",null,{"$f":"IF(C12=\"OFF\",((EXP((0-G20)*D20))*D18*C24-D19*(EXP((0-G18)*D20))*C27),0)","v":{"$error":"#DIV/0!"}}]
[null,"Value of all options outstanding =",null,null,{"$f":"D29*E9","v":{"$error":"#DIV/0!"}}]
{"$rows_left_out":1}
{"sheet":"RIVN_IS","index":4,"n_rows":55,"n_cols":8,"rows_kept":55,"cut":false,"hidden":false,"merged":[]}
[]
[]
[]
[]
["Rivian Automotive, Inc. (NasdaqGS:RIVN) > Financials > Income Statement"]
[]
[null,"Template:","As Presented"," ","Restatement:","Latest Filings"]
[null,"Period Type:","Annual"," ","Order:","Latest on Right"]
[null,"Currency:","Reported Currency"," ","Conversion:","Historical"]
[null,"Units:","S&P Capital IQ (Default)"," ","Decimals:","Capital IQ (Default)"]
[null,"Source:","Capital IQ & Proprietary Data"," "]
[]
[]
["Income Statement",2019,2020,2021,2022,2023,2024,2025]
["For the Fiscal Period Ending\n","12 months\nDec-31-2019","12 months\nDec-31-2020","12 months\nDec-31-2021","12 months\nDec-31-2022","12 months\nDec-31-2023","12 months\nDec-31-2024","12 months\nDec-31-2025"]
["Currency","USD","USD","USD","USD","USD","USD","USD"]
["Units","Millions","Millions","Millions","Millions","Millions","Millions","Millions"]
["Revenues"]
["Revenues: Automotive","-","-",null,1554,4132,4486,3830]
["Revenues: Software Service","-","-","-",104,302,484,1557]
["  Revenues","-","-",55,"-","-","-","-"]
["  Total Revenues",null,null,{"$f":"D21","v":55},1658,4434,4970,5387]
[]
["Expenses",{"$f":"0*(-1)","v":0},0,0,0,0,0]
["  Cost of Revenues",{"$f":"0*(-1)","v":0},0,{"$f":"-520*(-1)","v":520},{"$f":"0*(-1)","v":0},{"$f":"0*(-1)","v":0},{"$f":"0*(-1)","v":0},"-"]
["  Cost of Revenues: Software Service",0,0,{"$f":"0*(-1)","v":0},{"$f":"-115*(-1)","v":115},{"$f":"-314*(-1)","v":314},{"$f":"-477*(-1)","v":477},{"$f":"-981*(-1)","v":981}]
["  Cost of Revenues: Automotive",0,0,{"$f":"-520*(-1)","v":520},{"$f":"-4666*(-1)","v":4666},{"$f":"-6150*(-1)","v":6150},{"$f":"-5693*(-1)","v":5693},{"$f":"-4262*(-1)","v":4262}]
["  Selling, General and Administrative",{"$f":"-108*(-1)","v":108},{"$f":"-255*(-1)","v":255},{"$f":"-1242*(-1)","v":1242},{"$f":"-1789*(-1)","v":1789},{"$f":"-1714*(-1)","v":1714},{"$f":"-1876*(-1)","v":1876},{"$f":"-2061*(-1)","v":2061}]
["  Research and Development",{"$f":"-301*(-1)","v":301},{"$f":"-766*(-1)","v":766},{"$f":"-1850*(-1)","v":1850},{"$f":"-1944*(-1)","v":1944},{"$f":"-1995*(-1)","v":1995},{"$f":"-1613*(-1)","v":1613},{"$f":"-1668*(-1)","v":1668}]
["  Other Expenses","-","-",{"$f":"-663*(-1)","v":663},"-","-","-","-"]
{"$rows_left_out":26}
{"sheet":"RIVN_BS","index":5,"n_rows":57,"n_cols":8,"rows_kept":57,"cut":false,"hidden":false,"merged":[]}
[]
[]
[]
[]
["Rivian Automotive, Inc. (NasdaqGS:RIVN) > Financials > Balance Sheet"]
[]
[null,"Template:","As Presented"," ","Restatement:","Latest Filings"]
[null,"Period Type:","Annual"," ","Order:","Latest on Right"]
[null,"Currency:","Reported Currency"," ","Conversion:","Historical"]
[null,"Units:","S&P Capital IQ (Default)"," ","Decimals:","Capital IQ (Default)"]
[null,"Source:","Capital IQ & Proprietary Data"," "]
[]
[]
["Balance Sheet",2019,2020,2021,2022,2023,2024,2025]
["Balance Sheet as of:\n","2019-12-31","2020-12-31","2021-12-31","2022-12-31","2023-12-31","2024-12-31","2025-12-31"]
["Currency","USD","USD","USD","USD","USD","USD","USD"]
["Units","Millions","Millions","Millions","Millions","Millions","Millions","Millions"]
["Current Assets"]
["  Cash and Cash Equivalents",2264,2979,18133,11568,7857,5294,3579]
["  Short-term Investments",null,null,null,null,1511,2406,2503]
["  Accounts Receivable, Net","-",6,26,102,161,443,555]
["  Inventory",null,null,274,1348,2620,2248,1594]
["  Other Current Assets",29,31,126,112,164,192,361]
[" Total Current Assets",2293,3016,18559,13130,12313,10583,8592]
[]
["Non Current Assets"]
["  Operating Lease Assets – Net",null,80,228,330,356,416,571]
["  Property, Plant and Equipment, Net",313,1445,3183,3758,3874,3965,5119]
["  Other Non-current Assets",27,61,324,658,235,446,582]
["  Total Assets",2633,4602,22294,17876,16778,15410,14864]
{"$rows_left_out":28}
{"sheet":"RIVN_CFS","index":6,"n_rows":62,"n_cols":7,"rows_kept":62,"cut":false,"hidden":false,"merged":[]}
[]
[]
[]
[]
["Rivian Automotive, Inc. (NasdaqGS:RIVN) > Financials > Cash Flow"]
[]
[null,"Template:","As Presented"," ","Restatement:","Latest Filings"]
[null,"Period Type:","Annual"," ","Order:","Latest on Right"]
[null,"Currency:","Reported Currency"," ","Conversion:","Historical"]
[null,"Units:","S&P Capital IQ (Default)"," ","Decimals:","Capital IQ (Default)"]
[null,"Source:","Capital IQ & Proprietary Data"," "]
[]
[]
["Cash Flow"]
["For the Fiscal Period Ending\n","12 months\nDec-31-2020","12 months\nDec-31-2021","12 months\nDec-31-2022","12 months\nDec-31-2023","12 months\nDec-31-2024","12 months\nDec-31-2025"]
["Currency","USD","USD","USD","USD","USD","USD"]
["Units","Millions","Millions","Millions","Millions","Millions","Millions"]
["Operating Activities"]
["  Net Income",-1018,-4688,-6752,"-","-","-"]
["  Net Loss","-","-","-",-5432,-4746,-3626]
["  Depreciation and Amortization",29,197,652,937,1031,784]
["  Gain on Equity Method Investment","-","-","-","-","-",-101]
["  Stock Based Compenation Expense","-",570,987,821,692,741]
["  Inventory LCNRV write-downs and losses on firm purchase Commitments","-",95,920,"-","-","-"]
["  Other Non-current Assets",-8,-8,"-","-","-","-"]
["  Other Non-current Liabilities",-1,18,"-","-","-","-"]
["  Other Expenses","-",643,"-","-","-","-"]
["  Other Non-cash Activities",41,36,82,222,28,-17]
["  Loss on Convertible Notes, Net","-",441,"-","-",112,"-"]
["  Accounts Receivable",11,-20,-76,-59,-282,-112]
{"$rows_left_out":32}