{"text_format":"1","workbook":"xlsx","n_sheets":7,"sheets":["DOCU_DCF","DOCU_Forecast","DOCU_IS","DOCU_BS","DOCU_CFS"," _Comps","Option_Value"],"not_rendered":{"charts":0,"images":1,"macros":1,"external_links":0,"defined_names":21,"comments":3,"pivot_tables":0},"unopened":[],"bounds":{"document_bytes":16777216,"sheet_cells":100000,"rows_first":2000,"rows_last":500,"rows_between":2000,"halvings":0,"cell_chars":16384,"cell_head_chars":4096},"cells_cut":0,"cells_raw":0,"read":"whole","date_system":"1900"}

{"sheet":"DOCU_DCF","index":0,"n_rows":155,"n_cols":21,"rows_kept":155,"cut":false,"hidden":false,"merged":[]}
[]
[null,"Company Name","DocuSign"]
[null,"Ticker","DOCU"]
[null,"Share Price",53.89]
[null,"Valuation Date ","2024-03-07"]
[]
[null,{"$f":"C2&\" (\"&C3&\") DISCOUNTED CASH FLOWS MODEL\"","v":"DocuSign (DOCU) DISCOUNTED CASH FLOWS MODEL"}]
[null,"Fiscal year ends in January USD in thousands except per share data."]
[]
["x","FORECASTING CASH FLOWS"]
[]
[null,null,null,null,null,"Historical",null,null,null,null,"Projected"]
[null,null,null,null,null,2019,{"$f":"F13+1","v":2020},2021,2022,2023,2024,2025,2026,2027,2028,2029,2030]
[null,"Revenue - subscription",null,null,null,{"$f":"INDEX(DOCU_IS!$A$10:$F$54,MATCH(DOCU_DCF!$B14,DOCU_IS!$A$10:$A$54,0),MATCH(DOCU_DCF!F$13,DOCU_IS!$A$10:$F$10,0))","v":663657},{"$f":"INDEX(DOCU_IS!$A$10:$F$54,MATCH(DOCU_DCF!$B14,DOCU_IS!$A$10:$A$54,0),MATCH(DOCU_DCF!G$13,DOCU_IS!$A$10:$F$10,0))","v":918463},{"$f":"INDEX(DOCU_IS!$A$10:$F$54,MATCH(DOCU_DCF!$B14,DOCU_IS!$A$10:$A$54,0),MATCH(DOCU_DCF!H$13,DOCU_IS!$A$10:$F$10,0))","v":1381397},{"$f":"INDEX(DOCU_IS!$A$10:$F$54,MATCH(DOCU_DCF!$B14,DOCU_IS!$A$10:$A$54,0),MATCH(DOCU_DCF!I$13,DOCU_IS!$A$10:$F$10,0))","v":2037272},{"$f":"INDEX(DOCU_IS!$A$10:$F$54,MATCH(DOCU_DCF!$B14,DOCU_IS!$A$10:$A$54,0),MATCH(DOCU_DCF!J$13,DOCU_IS!$A$10:$F$10,0))","v":2442177},{"$f":"J14*(1+K38)","v":2670000},2864764.5,3079621.8374999999,3325991.5845000003,3592070.9112600004,3879436.5841608006,4189791.5108936648]
[null,"Revenue - professional services & other revenue",null,null,null,{"$f":"INDEX(DOCU_IS!$A$10:$F$54,MATCH(DOCU_DCF!$B15,DOCU_IS!$A$10:$A$54,0),MATCH(DOCU_DCF!F$13,DOCU_IS!$A$10:$F$10,0))","v":37312},{"$f":"INDEX(DOCU_IS!$A$10:$F$54,MATCH(DOCU_DCF!$B15,DOCU_IS!$A$10:$A$54,0),MATCH(DOCU_DCF!G$13,DOCU_IS!$A$10:$F$10,0))","v":55508},{"$f":"INDEX(DOCU_IS!$A$10:$F$54,MATCH(DOCU_DCF!$B15,DOCU_IS!$A$10:$A$54,0),MATCH(DOCU_DCF!H$13,DOCU_IS!$A$10:$F$10,0))","v":71650},{"$f":"INDEX(DOCU_IS!$A$10:$F$54,MATCH(DOCU_DCF!$B15,DOCU_IS!$A$10:$A$54,0),MATCH(DOCU_DCF!I$13,DOCU_IS!$A$10:$F$10,0))","v":69941},{"$f":"INDEX(DOCU_IS!$A$10:$F$54,MATCH(DOCU_DCF!$B15,DOCU_IS!$A$10:$A$54,0),MATCH(DOCU_DCF!J$13,DOCU_IS!$A$10:$F$10,0))","v":73738},76000,73455.5,78964.662500000093,85281.83550000003,92104.382339999996,99472.73292719973,107430.55156137543]
[null,"Total Revenue",null,null,null,{"$f":"INDEX(DOCU_IS!$A$10:$F$54,MATCH(DOCU_DCF!$B16,DOCU_IS!$A$10:$A$54,0),MATCH(DOCU_DCF!F$13,DOCU_IS!$A$10:$F$10,0))","v":700969},{"$f":"INDEX(DOCU_IS!$A$10:$F$54,MATCH(DOCU_DCF!$B16,DOCU_IS!$A$10:$A$54,0),MATCH(DOCU_DCF!G$13,DOCU_IS!$A$10:$F$10,0))","v":973971},{"$f":"INDEX(DOCU_IS!$A$10:$F$54,MATCH(DOCU_DCF!$B16,DOCU_IS!$A$10:$A$54,0),MATCH(DOCU_DCF!H$13,DOCU_IS!$A$10:$F$10,0))","v":1453047},{"$f":"INDEX(DOCU_IS!$A$10:$F$54,MATCH(DOCU_DCF!$B16,DOCU_IS!$A$10:$A$54,0),MATCH(DOCU_DCF!I$13,DOCU_IS!$A$10:$F$10,0))","v":2107213},{"$f":"INDEX(DOCU_IS!$A$10:$F$54,MATCH(DOCU_DCF!$B16,DOCU_IS!$A$10:$A$54,0),MATCH(DOCU_DCF!J$13,DOCU_IS!$A$10:$F$10,0))","v":2515915},2746000,2938220,3158586.5,3411273.4200000004,3684175.2936000004,3978909.3170880009,4297222.0624550413]
[null,"Cost of revenue - subscription",null,null,null,{"$f":"INDEX(DOCU_IS!$A$10:$F$54,MATCH(DOCU_DCF!$B17,DOCU_IS!$A$10:$A$54,0),MATCH(DOCU_DCF!F$13,DOCU_IS!$A$10:$F$10,0))","v":117764},{"$f":"INDEX(DOCU_IS!$A$10:$F$54,MATCH(DOCU_DCF!$B17,DOCU_IS!$A$10:$A$54,0),MATCH(DOCU_DCF!G$13,DOCU_IS!$A$10:$F$10,0))","v":163931},{"$f":"INDEX(DOCU_IS!$A$10:$F$54,MATCH(DOCU_DCF!$B17,DOCU_IS!$A$10:$A$54,0),MATCH(DOCU_DCF!H$13,DOCU_IS!$A$10:$F$10,0))","v":259992},{"$f":"INDEX(DOCU_IS!$A$10:$F$54,MATCH(DOCU_DCF!$B17,DOCU_IS!$A$10:$A$54,0),MATCH(DOCU_DCF!I$13,DOCU_IS!$A$10:$F$10,0))","v":343661},{"$f":"INDEX(DOCU_IS!$A$10:$F$54,MATCH(DOCU_DCF!$B17,DOCU_IS!$A$10:$A$54,0),MATCH(DOCU_DCF!J$13,DOCU_IS!$A$10:$F$10,0))","v":426077},{"$f":"K14*K41","v":453900.00000000006},487009.96500000003,523535.712375,565418.56936500012,610652.0549142001,659504.21930733614,712264.55685192312]
[null,"Cost of revenue - professional services & other cost of revenue",null,null,null,{"$f":"INDEX(DOCU_IS!$A$10:$F$54,MATCH(DOCU_DCF!$B18,DOCU_IS!$A$10:$A$54,0),MATCH(DOCU_DCF!F$13,DOCU_IS!$A$10:$F$10,0))","v":74657},{"$f":"INDEX(DOCU_IS!$A$10:$F$54,MATCH(DOCU_DCF!$B18,DOCU_IS!$A$10:$A$54,0),MATCH(DOCU_DCF!G$13,DOCU_IS!$A$10:$F$10,0))","v":79303},{"$f":"INDEX(DOCU_IS!$A$10:$F$54,MATCH(DOCU_DCF!$B18,DOCU_IS!$A$10:$A$54,0),MATCH(DOCU_DCF!H$13,DOCU_IS!$A$10:$F$10,0))","v":104066},{"$f":"INDEX(DOCU_IS!$A$10:$F$54,MATCH(DOCU_DCF!$B18,DOCU_IS!$A$10:$A$54,0),MATCH(DOCU_DCF!I$13,DOCU_IS!$A$10:$F$10,0))","v":122790},{"$f":"INDEX(DOCU_IS!$A$10:$F$54,MATCH(DOCU_DCF!$B18,DOCU_IS!$A$10:$A$54,0),MATCH(DOCU_DCF!J$13,DOCU_IS!$A$10:$F$10,0))","v":110011},114000,104674.08750000001,106602.29437500013,108734.34026250005,110525.25880800001,119367.27951263967,128916.6618736505]
[null,"Gross Profit",null,null,null,{"$f":"F16-F17-F18","v":508548},730737,1088989,1640762,1979827,2178100,2346535.9475000002,2528448.4932499998,2737120.5103725004,2962997.9798778002,3200037.8182680253,3456040.8437294681]
[]
[null,"Sales & marketing expense",null,null,null,{"$f":"INDEX(DOCU_IS!$A$10:$F$54,MATCH(DOCU_DCF!$B21,DOCU_IS!$A$10:$A$54,0),MATCH(DOCU_DCF!F$13,DOCU_IS!$A$10:$F$10,0))","v":539606},{"$f":"INDEX(DOCU_IS!$A$10:$F$54,MATCH(DOCU_DCF!$B21,DOCU_IS!$A$10:$A$54,0),MATCH(DOCU_DCF!G$13,DOCU_IS!$A$10:$F$10,0))","v":591379},{"$f":"INDEX(DOCU_IS!$A$10:$F$54,MATCH(DOCU_DCF!$B21,DOCU_IS!$A$10:$A$54,0),MATCH(DOCU_DCF!H$13,DOCU_IS!$A$10:$F$10,0))","v":798625},{"$f":"INDEX(DOCU_IS!$A$10:$F$54,MATCH(DOCU_DCF!$B21,DOCU_IS!$A$10:$A$54,0),MATCH(DOCU_DCF!I$13,DOCU_IS!$A$10:$F$10,0))","v":1076527},{"$f":"INDEX(DOCU_IS!$A$10:$F$54,MATCH(DOCU_DCF!$B21,DOCU_IS!$A$10:$A$54,0),MATCH(DOCU_DCF!J$13,DOCU_IS!$A$10:$F$10,0))","v":1242711},{"$f":"K16*K43","v":1235700},1248743.5,1263434.5999999999,1279227.5325,1289461.3527599999,1392618.2609808003,1504027.7218592644]
[null,"Research & development expense",null,null,null,{"$f":"INDEX(DOCU_IS!$A$10:$F$54,MATCH(DOCU_DCF!$B22,DOCU_IS!$A$10:$A$54,0),MATCH(DOCU_DCF!F$13,DOCU_IS!$A$10:$F$10,0))","v":185968},{"$f":"INDEX(DOCU_IS!$A$10:$F$54,MATCH(DOCU_DCF!$B22,DOCU_IS!$A$10:$A$54,0),MATCH(DOCU_DCF!G$13,DOCU_IS!$A$10:$F$10,0))","v":185552},{"$f":"INDEX(DOCU_IS!$A$10:$F$54,MATCH(DOCU_DCF!$B22,DOCU_IS!$A$10:$A$54,0),MATCH(DOCU_DCF!H$13,DOCU_IS!$A$10:$F$10,0))","v":271522},{"$f":"INDEX(DOCU_IS!$A$10:$F$54,MATCH(DOCU_DCF!$B22,DOCU_IS!$A$10:$A$54,0),MATCH(DOCU_DCF!I$13,DOCU_IS!$A$10:$F$10,0))","v":393362},{"$f":"INDEX(DOCU_IS!$A$10:$F$54,MATCH(DOCU_DCF!$B22,DOCU_IS!$A$10:$A$54,0),MATCH(DOCU_DCF!J$13,DOCU_IS!$A$10:$F$10,0))","v":480584},{"$f":"K16*K44","v":521740},550916.25,584338.50249999994,622557.39915000007,663151.55284800008,716203.67707584018,773499.97124190745]
[null,"General & administrative expense",null,null,null,{"$f":"INDEX(DOCU_IS!$A$10:$F$54,MATCH(DOCU_DCF!$B23,DOCU_IS!$A$10:$A$54,0),MATCH(DOCU_DCF!F$13,DOCU_IS!$A$10:$F$10,0))","v":209297},{"$f":"INDEX(DOCU_IS!$A$10:$F$54,MATCH(DOCU_DCF!$B23,DOCU_IS!$A$10:$A$54,0),MATCH(DOCU_DCF!G$13,DOCU_IS!$A$10:$F$10,0))","v":147315},{"$f":"INDEX(DOCU_IS!$A$10:$F$54,MATCH(DOCU_DCF!$B23,DOCU_IS!$A$10:$A$54,0),MATCH(DOCU_DCF!H$13,DOCU_IS!$A$10:$F$10,0))","v":192697},{"$f":"INDEX(DOCU_IS!$A$10:$F$54,MATCH(DOCU_DCF!$B23,DOCU_IS!$A$10:$A$54,0),MATCH(DOCU_DCF!I$13,DOCU_IS!$A$10:$F$10,0))","v":232757},{"$f":"INDEX(DOCU_IS!$A$10:$F$54,MATCH(DOCU_DCF!$B23,DOCU_IS!$A$10:$A$54,0),MATCH(DOCU_DCF!J$13,DOCU_IS!$A$10:$F$10,0))","v":316228},{"$f":"K16*K45","v":343250},341568.07499999995,339548.04874999996,336863.25022499997,331575.77642399992,358101.83853792009,386749.98562095372]
[null,"EBIT",null,null,null,{"$f":"F19-F21-F22-F23","v":-426323},-193509,-173855,-61884,-59696,77410,205308.12250000029,341127.34200000006,498472.32849750039,678809.29784580029,733114.04167346493,791763.16500734247]
[null,"NOL carryforward balance",null,null,null,null,null,null,null,2700000,{"$f":"J25-K24","v":2622590},{"$f":"K25-L24","v":2417281.8774999995},2076154.5354999993,1577682.2070024989,898872.90915669862,165758.86748323368,-626004.29752410878]
[null,"Taxes",null,0.25,null,null,null,null,null,null,{"$f":"IF(K25>0,0,K25*$D$26*-1)","v":0},{"$f":"IF(L25>0,0,L25*$D$26*-1)","v":0},0,0,0,0,156501.0743810272]
[null,"Tax-effected EBIT",null,null,null,{"$f":"F24-F26","v":-426323},-193509,-173855,-61884,-59696,77410,205308.12250000029,341127.34200000006,498472.32849750039,678809.29784580029,733114.04167346493,635262.09062631521]
[]
[null,"Depreciation and amortization",null,null,null,{"$f":"INDEX(DOCU_IS!$A$10:$F$60,MATCH(DOCU_DCF!$B29,DOCU_IS!$A$10:$A$60,0),MATCH(DOCU_DCF!F$13,DOCU_IS!$A$10:$F$10,0))","v":38027},{"$f":"INDEX(DOCU_IS!$A$10:$F$60,MATCH(DOCU_DCF!$B29,DOCU_IS!$A$10:$A$60,0),MATCH(DOCU_DCF!G$13,DOCU_IS!$A$10:$F$10,0))","v":50182},{"$f":"INDEX(DOCU_IS!$A$10:$F$60,MATCH(DOCU_DCF!$B29,DOCU_IS!$A$10:$A$60,0),MATCH(DOCU_DCF!H$13,DOCU_IS!$A$10:$F$10,0))","v":71090},{"$f":"INDEX(DOCU_IS!$A$10:$F$60,MATCH(DOCU_DCF!$B29,DOCU_IS!$A$10:$A$60,0),MATCH(DOCU_DCF!I$13,DOCU_IS!$A$10:$F$10,0))","v":81913},{"$f":"INDEX(DOCU_IS!$A$10:$F$60,MATCH(DOCU_DCF!$B29,DOCU_IS!$A$10:$A$60,0),MATCH(DOCU_DCF!J$13,DOCU_IS!$A$10:$F$10,0))","v":86255},{"$f":"-K30*K47","v":90618.000000000015},85851.115625000006,80938.779062500005,75794.231300625004,69999.330578399997,75599.277024672017,81647.219186645787]
[null,"Capex",null,null,null,{"$f":"INDEX(DOCU_IS!$A$10:$F$59,MATCH(DOCU_DCF!$B30,DOCU_IS!$A$10:$A$59,0),MATCH(DOCU_DCF!F$13,DOCU_IS!$A$10:$F$10,0))","v":-30413},{"$f":"INDEX(DOCU_IS!$A$10:$F$59,MATCH(DOCU_DCF!$B30,DOCU_IS!$A$10:$A$59,0),MATCH(DOCU_DCF!G$13,DOCU_IS!$A$10:$F$10,0))","v":-72046},{"$f":"INDEX(DOCU_IS!$A$10:$F$59,MATCH(DOCU_DCF!$B30,DOCU_IS!$A$10:$A$59,0),MATCH(DOCU_DCF!H$13,DOCU_IS!$A$10:$F$10,0))","v":-82395},{"$f":"INDEX(DOCU_IS!$A$10:$F$59,MATCH(DOCU_DCF!$B30,DOCU_IS!$A$10:$A$59,0),MATCH(DOCU_DCF!I$13,DOCU_IS!$A$10:$F$10,0))","v":-61396},{"$f":"INDEX(DOCU_IS!$A$10:$F$59,MATCH(DOCU_DCF!$B30,DOCU_IS!$A$10:$A$59,0),MATCH(DOCU_DCF!J$13,DOCU_IS!$A$10:$F$10,0))","v":-77654},{"$f":"-K46*K16","v":-82380},{"$f":"-L46*L16","v":-80801.05},-78964.662500000006,-76753.651950000014,-73683.505872000023,-79578.186341760025,-85944.441249100826]
{"$rows_left_out":126}
{"sheet":"DOCU_Forecast","index":1,"n_rows":47,"n_cols":15,"rows_kept":47,"cut":false,"hidden":false,"merged":[]}
[]
[null,"Key metrics (Annual)"]
[null,null,2019,{"$f":"C3+1","v":2020},{"$f":"D3+1","v":2021},2022,2023,2024,2025,2026,2027,2028]
[null,"Revenue",700969,973971,1453047,2107213,2515915,2746000,{"$f":"H4*(1+I8)","v":2938220},{"$f":"I4*(1+J8)","v":3158586.5},{"$f":"J4*(1+K8)","v":3411273.4200000004},{"$f":"K4*(1+L8)","v":3684175.2936000004}]
[null," Direct (%)",0.85,0.86,0.87,0.88,0.87,0.86,0.85499999999999998,{"$f":"I5","v":0.85499999999999998},0.85499999999999998,0.85499999999999998]
[null," Digital (%)",0.15,0.14000000000000001,0.13,0.12,0.13,0.14000000000000001,0.14499999999999999,0.14499999999999999,0.14499999999999999,0.14499999999999999]
[]
[null,"Revenue growth",null,null,null,null,null,{"$f":"H4/G4-1","v":9.1451817728341434E-2},7.0000000000000007E-2,7.4999999999999997E-2,0.08,0.08]
[]
[null," Subscription Revenue",663657,918463,1381397,2037272,2442177,2670000,{"$f":"I4*I11","v":2864764.5},{"$f":"J4*J11","v":3079621.8374999999},{"$f":"K4*K11","v":3325991.5845000003},{"$f":"L4*L11","v":3592070.9112600004}]
[null," % of revenue",{"$f":"C10/C4","v":0.94677082724057693},{"$f":"D10/D4","v":0.94300857007036143},0.9506898262754061,0.96680876589125064,0.97069137868330213,0.97499999999999998,0.97499999999999998,0.97499999999999998,0.97499999999999998,0.97499999999999998]
[null," % growth",null,null,null,null,null,{"$f":"H10/G10-1","v":9.3286850216016237E-2},{"$f":"I10/H10-1","v":7.2945505617977524E-2},{"$f":"J10/I10-1","v":7.4999999999999956E-2},{"$f":"K10/J10-1","v":8.0000000000000071E-2},{"$f":"L10/K10-1","v":8.0000000000000071E-2}]
[null,"Professional Revenue ",null,null,null,null,{"$f":"G4-G10","v":73738},76000,73455.5,78964.662500000093,85281.835500000045,92104.382340000011]
[null," % growth",null,null,null,null,null,{"$f":"H13/G13-1","v":3.0676177818763639E-2},{"$f":"I13/H13-1","v":-3.3480263157894763E-2},{"$f":"J13/I13-1","v":7.5000000000001288E-2},{"$f":"K13/J13-1","v":7.9999999999999183E-2},{"$f":"L13/K13-1","v":7.9999999999999627E-2}]
[]
[null,"Customers (in thousands)",477,589,892,1170,1360,{"$f":"G16*(1+H17)","v":1536.8},{"$f":"H16*(1+I17)","v":1713.5319999999999},{"$f":"I16*(1+J17)","v":1867.7498800000001},{"$f":"J16*(1+K17)","v":2017.1698704000003},{"$f":"K16*(1+L17)","v":2158.3717613280005}]
[null,"% growth",null,{"$f":"D16/C16-1","v":0.23480083857442358},{"$f":"E16/D16-1","v":0.51443123938879465},{"$f":"F16/E16-1","v":0.31165919282511201},{"$f":"G16/F16-1","v":0.16239316239316248},0.13,0.115,0.09,0.08,7.0000000000000007E-2]
[null," Enterprise",56,75,125,170,211,{"$f":"G18*(1+H19)","v":242.64999999999998},{"$f":"H18*(1+I19)","v":274.19449999999995},{"$f":"I18*(1+J19)","v":301.61394999999999},{"$f":"J18*(1+K19)","v":327.25113575},{"$f":"K18*(1+L19)","v":351.79497093124996}]
[null,"  % growth",null,{"$f":"D18/C18-1","v":0.33928571428571419},{"$f":"E18/D18-1","v":0.66666666666666674},{"$f":"F18/E18-1","v":0.3600000000000001},{"$f":"G18/F18-1","v":0.24117647058823533},0.15,0.13,0.1,8.5000000000000006E-2,7.4999999999999997E-2]
[null," Small ",{"$f":"C16-C18","v":421},514,767,1000,1149,1294.1500000000001,1439.3375000000001,1566.1359300000001,1689.9187346500003,1806.5767903967505]
[null,"  % growth",null,{"$f":"D20/C20-1","v":0.2209026128266034},0.49221789883268485,0.30378096479791394,0.14900000000000002,0.12632724107919935,0.11218753622068545,8.8094995093228601E-2,7.9037076079341295E-2,6.9031754814477209E-2]
[]
[null,"Large (>300k)",310,437,599,852,1080,{"$f":"G23*(1+H24)","v":1069.2},{"$f":"H23*(1+I24)","v":1101.2760000000001},{"$f":"I23*(1+J24)","v":1156.3398000000002},{"$f":"J23*(1+K24)","v":1214.1567900000002},{"$f":"K23*(1+L24)","v":1274.8646295000003}]
[null,"% growth",null,{"$f":"D23/C23-1","v":0.4096774193548387},{"$f":"E23/D23-1","v":0.37070938215102966},{"$f":"F23/E23-1","v":0.42237061769616036},{"$f":"G23/F23-1","v":0.26760563380281699},-0.01,0.03,0.05,0.05,0.05]
[]
[null,"Enterprise/Direct ARPC",{"$f":"(C4*C5)/C18","v":10639.708035714286},11168.200799999999,10113.207119999999,10907.926117647059,10373.677962085307,9732.3717288275311,9162.0295082505327,8953.8015648811997,8912.5398065176942,8953.9934800363808]
[null,"Digital ARPC",{"$f":"(C4*C6)/C20","v":249.75142517814726},265.28392996108948,246.27915254237291,252.86555999999999,284.65530896431682,297.05984623111698,295.99861047183163,{"$f":"(J4*J6)/J20","v":292.43632926549355},{"$f":"(K4*K6)/K20","v":292.69729706999431},{"$f":"(L4*L6)/L20","v":295.70036569255427}]
[]
[]
[]
{"$rows_left_out":18}
{"sheet":"DOCU_IS","index":2,"n_rows":60,"n_cols":6,"rows_kept":60,"cut":false,"hidden":false,"merged":[]}
[]
[]
[]
["Powered by Clearbit"]
["DocuSign Inc (NMS: DOCU)"]
[]
["Exchange rate used is that of the Year End reported date "]
[]
[]
["As Reported Annual Income Statement ",{"$f":"YEAR(B11)","v":2023},{"$f":"YEAR(C11)","v":2022},{"$f":"YEAR(D11)","v":2021},{"$f":"YEAR(E11)","v":2020},{"$f":"YEAR(F11)","v":2019}]
["Report Date","01/31/2023","01/31/2022","01/31/2021","01/31/2020","01/31/2019"]
["Currency","USD","USD","USD","USD","USD"]
["Audit Status","Not Qualified","Not Qualified","Not Qualified","Not Qualified","Not Qualified"]
["Consolidated","Yes","Yes","Yes","Yes","Yes"]
["Scale","Thousands","Thousands","Thousands","Thousands","Thousands"]
["Revenue - subscription",2442177,2037272,1381397,918463,663657]
["Revenue - professional services & other revenue",73738,69941,71650,55508,37312]
["Total revenue",2515915,2107213,1453047,973971,700969]
["Cost of revenue - subscription",426077,343661,259992,163931,117764]
["Cost of revenue - professional services & other cost of revenue",110011,122790,104066,79303,74657]
["Total cost of revenue",536088,466451,364058,243234,192421]
["Gross profit",1979827,1640762,1088989,730737,508548]
["Sales & marketing expense",1242711,1076527,798625,591379,539606]
["Research & development expense",480584,393362,271522,185552,185968]
["General & administrative expense",316228,232757,192697,147315,209297]
["Restructuring & other related charges",28335,"-","-","-","-"]
["Total operating expenses",2067858,1702646,1262844,924246,934871]
["Income (loss) from operations",-88031,-61884,-173855,-193509,-426323]
["Interest expense",6389,6443,30799,29254,10844]
["Gain (loss) on extinguishment of debt","-","-",-33752,"-","-"]
{"$rows_left_out":31}
{"sheet":"DOCU_BS","index":3,"n_rows":67,"n_cols":6,"rows_kept":67,"cut":false,"hidden":false,"merged":[]}
[]
[]
[]
["Powered by Clearbit"]
["DocuSign Inc (NMS: DOCU)"]
[]
["Exchange rate used is that of the Year End reported date "]
[]
[]
["As Reported Annual Balance Sheet ",{"$f":"YEAR(B11)","v":2023},{"$f":"YEAR(C11)","v":2022},{"$f":"YEAR(D11)","v":2021},{"$f":"YEAR(E11)","v":2020},{"$f":"YEAR(F11)","v":2019}]
["Report Date","01/31/2023","01/31/2022","01/31/2021","01/31/2020","01/31/2019"]
["Currency","USD","USD","USD","USD","USD"]
["Audit Status","Not Qualified","Not Qualified","Not Qualified","Not Qualified","Not Qualified"]
["Consolidated","Yes","Yes","Yes","Yes","Yes"]
["Scale","Thousands","Thousands","Thousands","Thousands","Thousands"]
["Cash & cash equivalents",721895,509059,566055,241203,517811]
["Investments",309771,293763,207450,414939,251203]
["Restricted cash","-","-","-",280,367]
["Accounts receivable, gross",522925,446757,328932,240841,175148]
["Allowance for doubtful accounts",6011,5807,5362,3000,600]
["Accounts receivable, net",516914,440950,323570,237841,174548]
["Contract assets - current",12437,12588,16883,12502,10616]
["Prepaid expenses","-","-","-",24429,18415]
["Other current assets","-","-","-",12696,11561]
["Prepaid expenses & other current assets",69987,63236,48390,37125,29976]
["Total current assets",1631004,1319596,1162348,943890,984521]
["Investments - noncurrent",186049,94938,92717,239729,164220]
["Computer & network equipment",138869,127799,102163,66937,55233]
["Software, including capitalized software development costs",114524,82537,56858,33373,27959]
["Furniture & office equipment",20897,20939,21682,16752,9511]
{"$rows_left_out":38}
{"sheet":"DOCU_CFS","index":4,"n_rows":66,"n_cols":6,"rows_kept":66,"cut":false,"hidden":false,"merged":[]}
[]
[]
[]
["Powered by Clearbit"]
["DocuSign Inc (NMS: DOCU)"]
[]
["Exchange rate used is that of the Year End reported date "]
[]
[]
["As Reported Annual Cash Flow "]
["Report Date","01/31/2023","01/31/2022","01/31/2021","01/31/2020","01/31/2019"]
["Currency","USD","USD","USD","USD","USD"]
["Audit Status","Not Qualified","Not Qualified","Not Qualified","Not Qualified","Not Qualified"]
["Consolidated","Yes","Yes","Yes","Yes","Yes"]
["Scale","Thousands","Thousands","Thousands","Thousands","Thousands"]
["Net income (loss)",-97454,-69976,-243267,-208359,-426458]
["Depreciation & amortization expense",86255,81913,71090,50182,38027]
["Amortization of deferred contract acquisition & fulfillment costs",185045,144442,99384,69747,42112]
["Amortization of debt discount & transaction costs",4970,5098,28001,26389,9507]
["Loss (gain) on extinguishment of debt","-","-",33752,"-","-"]
["Operating cash flow related to repayments of convertible senior notes","-","-",-75165,"-","-"]
["Non-cash operating lease costs",27501,26819,26728,19435,"-"]
["Stock-based compensation expense",538726,408542,286877,206404,410978]
["Deferred income taxes",1697,1369,-2410,1287,-5001]
["Other adjustments",15723,9871,-210,-1741,800]
["Accounts receivable",-75964,-117380,-73913,-63293,-42571]
["Contract assets","-",4893,1912,-1508,4204]
["Prepaid expenses & other current assets",-5038,-7074,-1155,-3142,-3283]
["Deferred contract acquisition & fulfillment costs",-232315,-207393,-208510,-115723,-80869]
["Other assets",-22319,-16389,-6006,1538,2658]
{"$rows_left_out":37}
{"sheet":" _Comps","index":5,"n_rows":26,"n_cols":17,"rows_kept":26,"cut":false,"hidden":false,"merged":[]}
[]
[null,{"$f":"DOCU_DCF!C2&\"Valuation with Public Comparables\"","v":"DocuSignValuation with Public Comparables"}]
[null,{"$f":"DOCU_DCF!B8","v":"Fiscal year ends in January USD in thousands except per share data."}]
[null,"Valuation for period ended "]
[null,"Ticker",{"$f":"DOCU_DCF!C3","v":"DOCU"}]
[null,"Valuation Date"]
[null,"Company Name",{"$f":"DOCU_DCF!C2","v":"DocuSign"},null,null,null,null,"Enterprise Value Multiples",null,null,null,null,null,"Equity Value Multiples"]
[null,null,null,null,null,"Market Value","Enterprise",null,null,null,"Forward","5 year growth","BV","Forward","Forward","Price(Market)-","Cash/MS as "]
[null,"Company","Ticker","Share price",null,"of Equity","Value","EV/Sales","EV/EBIT","EV/EBITDA","EPS","rate","Equity","P/E","PEG","to-Book","% of TA"]
[null,{"$f":"DOCU_DCF!C2","v":"DocuSign"},{"$f":"C5","v":"DOCU"},{"$f":"DOCU_DCF!C4","v":53.89}]
[]
[]
[]
[]
[]
[]
[]
[]
[null,null,null,null,null,null,"High"]
[null,null,null,null,null,null,"Mean"]
[null,null,null,null,null,null,"Median"]
[null,null,null,null,null,null,"Low"]
[]
[]
[null,null,null,"Implied price per share","Diluted shares outstanding","Implied Equity Value","Implied Enterprise Value","Range of EV/Sales","Range of EV/EBIT","Range of EV/EBITDA",null,null,null,"Range of Forward P/E","Range of Forward PEG","Range of Price-to-Book","Excess Cash"]
[null,{"$f":"DOCU_DCF!C2","v":"DocuSign"}]

{"sheet":"Option_Value","index":6,"n_rows":30,"n_cols":7,"rows_kept":30,"cut":false,"hidden":false,"merged":[]}
[]
[null,"Valuing Options or Warrants"]
[null,"Enter the current stock price ="]
[null,"Enter the strike price on the option ="]
[null,"Enter the expiration of the option ="]
[null,"Enter the standard deviation in stock prices =",null,null,null,"(volatility)"]
[null,"Enter the annualized dividend yield on stock ="]
[null,"Enter the treasury bond rate ="]
[null,"Enter the number of options outstanding ="]
[null,"Enter the number of shares outstanding ="]
[]
[null,"Circuit Breaker","OFF"]
[]
[null,"Do not input any numbers below this line"]
[null,"VALUING WARRANTS WHEN THERE IS DILUTION"]
[null,"Stock Price=",null,{"$f":"E3","v":0},"# Warrants issued=",null,{"$f":"E9","v":0}]
[null,"Strike Price=",null,{"$f":"E4","v":0},"# Shares outstanding=",null,{"$f":"E10","v":0}]
[null,"Adjusted S =",null,{"$f":"(D16*G17+D29*G16)/(G17+G16)","v":{"$error":"#DIV/0!"}},"T.Bond rate=",null,{"$f":"E8","v":0}]
[null,"Adjusted K =",null,{"$f":"D17","v":0},"Variance=",null,{"$f":"E6^2","v":0}]
[null,"Expiration (in years) =",null,{"$f":"E5","v":0},"Annualized dividend yield=",null,{"$f":"E7","v":0}]
[null,null,null,null,"Div. Adj. interest rate=",null,{"$f":"G18-G20","v":0}]
[]
[null,"d1 = ",{"$f":"(LN(D18/D19)+(G21+(G19/2))*D20)/(((G19)^(0.5))*(D20^0.5))","v":{"$error":"#DIV/0!"}}]
[null,"N (d1) =",{"$f":"NORMSDIST(C23)","v":{"$error":"#DIV/0!"}}]
[]
[null,"d2 = ",{"$f":"C23-((G19^0.5)*(D20^(0.5)))","v":{"$error":"#DIV/0!"}}]
[null,"N (d2) =",{"$f":"NORMSDIST(C26)","v":{"$error":"#DIV/0!"}}]
[]
[null,"Value per option = ",null,{"$f":"IF(C12=\"OFF\",((EXP((0-G20)*D20))*D18*C24-D19*(EXP((0-G18)*D20))*C27),0)","v":{"$error":"#DIV/0!"}}]
[null,"Value of all options outstanding =",null,null,{"$f":"D29*E9","v":{"$error":"#DIV/0!"}}]